Voxelands Forum

The official Voxelands discussion forum

You are not logged in.

#1 2015-09-21 16:09:43

cambam
Member
From: -61,3,12
Registered: 2015-09-06
Posts: 22

help build voxelands lubuntu

im trying to build this on lubuntu i have no idea what i am doing or what these fancy words i type into special parts of my compy mean but this is what i keep get back after i mixed a bit of your stuff with my stuff.

~/voxelands$ cmake -DRUN_IN_PLACE=1
-- The CXX compiler identification is unknown
-- Check for working CXX compiler: /home/noremac/voxelands/CMakeFiles/3.0.2/CompilerIdCXX
-- Check for working CXX compiler: /home/noremac/voxelands/CMakeFiles/3.0.2/CompilerIdCXX -- broken
CMake Error at /usr/share/cmake-3.0/Modules/CMakeTestCXXCompiler.cmake:54 (message):
  The C++ compiler "/home/noremac/voxelands/CMakeFiles/3.0.2/CompilerIdCXX"
  is not able to compile a simple test program.

  It fails with the following output:

   Change Dir: /home/noremac/voxelands/CMakeFiles/CMakeTmp

  

  Run Build Command:"/usr/bin/make" "cmTryCompileExec417236289/fast"

  /usr/bin/make -f CMakeFiles/cmTryCompileExec417236289.dir/build.make
  CMakeFiles/cmTryCompileExec417236289.dir/build

  make[1]: Entering directory '/home/noremac/voxelands/CMakeFiles/CMakeTmp'

  /usr/bin/cmake -E cmake_progress_report
  /home/noremac/voxelands/CMakeFiles/CMakeTmp/CMakeFiles 1

  Building CXX object
  CMakeFiles/cmTryCompileExec417236289.dir/testCXXCompiler.cxx.o

  /home/noremac/voxelands/CMakeFiles/3.0.2/CompilerIdCXX -o
  CMakeFiles/cmTryCompileExec417236289.dir/testCXXCompiler.cxx.o -c
  /home/noremac/voxelands/CMakeFiles/CMakeTmp/testCXXCompiler.cxx

  make[1]: execvp: /home/noremac/voxelands/CMakeFiles/3.0.2/CompilerIdCXX:
  Permission denied

  CMakeFiles/cmTryCompileExec417236289.dir/build.make:57: recipe for target
  'CMakeFiles/cmTryCompileExec417236289.dir/testCXXCompiler.cxx.o' failed

  make[1]: Leaving directory '/home/noremac/voxelands/CMakeFiles/CMakeTmp'

  make[1]: ***
  [CMakeFiles/cmTryCompileExec417236289.dir/testCXXCompiler.cxx.o] Error 127

  Makefile:118: recipe for target 'cmTryCompileExec417236289/fast' failed

  make: *** [cmTryCompileExec417236289/fast] Error 2

  

  

  CMake will not be able to correctly generate this project.
Call Stack (most recent call first):
  CMakeLists.txt:8 (project)


-- Configuring incomplete, errors occurred!
See also "/home/noremac/voxelands/CMakeFiles/CMakeOutput.log".
See also "/home/noremac/voxelands/CMakeFiles/CMakeError.log".

here is my error log from this

Checking whether the CXX compiler is IAR using "" did not match "IAR .+ Compiler":
Determining if the CXX compiler works failed with the following output:
Change Dir: /home/noremac/voxelands/CMakeFiles/CMakeTmp

Run Build Command:"/usr/bin/make" "cmTryCompileExec417236289/fast"
/usr/bin/make -f CMakeFiles/cmTryCompileExec417236289.dir/build.make CMakeFiles/cmTryCompileExec417236289.dir/build
make[1]: Entering directory '/home/noremac/voxelands/CMakeFiles/CMakeTmp'
/usr/bin/cmake -E cmake_progress_report /home/noremac/voxelands/CMakeFiles/CMakeTmp/CMakeFiles 1
Building CXX object CMakeFiles/cmTryCompileExec417236289.dir/testCXXCompiler.cxx.o
/home/noremac/voxelands/CMakeFiles/3.0.2/CompilerIdCXX     -o CMakeFiles/cmTryCompileExec417236289.dir/testCXXCompiler.cxx.o -c /home/noremac/voxelands/CMakeFiles/CMakeTmp/testCXXCompiler.cxx
make[1]: execvp: /home/noremac/voxelands/CMakeFiles/3.0.2/CompilerIdCXX: Permission denied
CMakeFiles/cmTryCompileExec417236289.dir/build.make:57: recipe for target 'CMakeFiles/cmTryCompileExec417236289.dir/testCXXCompiler.cxx.o' failed
make[1]: Leaving directory '/home/noremac/voxelands/CMakeFiles/CMakeTmp'
make[1]: *** [CMakeFiles/cmTryCompileExec417236289.dir/testCXXCompiler.cxx.o] Error 127
Makefile:118: recipe for target 'cmTryCompileExec417236289/fast' failed
make: *** [cmTryCompileExec417236289/fast] Error 2

Hopefully im not too much of a dumb dumb and have included enough info. Im pretty sure i downloaded all the stuff off of that list of yours but i might have missed something. Also, i used synaptic to find and install them all. i don't know if that makes one bit of difference.


Home = -61,3,12 Voxelands Survival. 458.8.868 Voxelands Adventure.

Offline

#2 2015-09-21 17:09:47

darkrose
Administrator
Registered: 2013-10-05
Posts: 743

Re: help build voxelands lubuntu

1. did you install build-essential (or maybe build-essentials)?
2. the ubuntu package on the downloads page should work for lubuntu.


Support Voxelands on Patreon: https://www.patreon.com/voxelands

Offline

#3 2015-09-21 20:37:05

cambam
Member
From: -61,3,12
Registered: 2015-09-06
Posts: 22

Re: help build voxelands lubuntu

yes that was exactly it silly me thought you were just saying they were "build essentials." lol. Anyway, i have them now and its building. thank you for your reply. Also i couldn't download the package because im running a 32 bit lubuntu not a 64......And built. Aww yay! Its totally working

Last edited by cambam (2015-09-21 20:40:01)


Home = -61,3,12 Voxelands Survival. 458.8.868 Voxelands Adventure.

Offline

#4 2015-09-22 01:50:55

darkrose
Administrator
Registered: 2013-10-05
Posts: 743

Re: help build voxelands lubuntu

cool smile


Support Voxelands on Patreon: https://www.patreon.com/voxelands

Offline

Board footer

Powered by FluxBB